Fatal Error Stringview No Such File Or Directory Sale

compile c++ file in linux terminal: string_view : No such file or ...

Sep 30, 2020 — the following error occurs: script.cpp:4:23: fatal error: string_view: No such file or directory #include ...1 answer  ·  Top answer: You'll need to update your compiler. std::string_view is not available in GCC until version 7.std=c++17 (optional, any, string_view, variant) - Stack OverflowMay 10, 2017

fatal error: string_view: No such file or directory #3849 - GitHub

Jun 18, 2018 — I follow this guide: $ git clone --depth 1 --branch quic-latest https://github.com/apache/trafficserver $ cd trafficserver $ autoreconf -if ...Missing: sale ‎| Must include: sale

make fails with stdafx.h:73:23: fatal error: string_view - GitHub

Jun 14, 2018 — Dear Wouter, I am trying to build treesheets from the repo. I built and installed wxWidgets 3.0.4 without any (visible) errors, ...

No such file or directory_ Even after attempting git checkout v6 ...

Dec 3, 2018 — It fails to find the file string_view. I tried the git checkout v6-10-00-patches and it does not seem to have an effect.String_view problem - ROOT ForumNov 7, 2017

fatal error: 'string_view' file not found (#19944) · Issues

Nov 8, 2019 — I am having trouble with the latest version of cmake-3.15.5 on FreeBSD. I have the same issue using several version of clang(6,8) and gcc9.Missing: sale ‎| Must include: sale

C++ 17 New Features and Trick - CodeProject

Mar 13, 2020 — If we explicitly mark the lambda expression with the constexpr keyword, then the compiler will generate an error when this expression does not ...

CPP / C++ Notes - GitHub Pages.

Jun 4, 2021 — Clang compiler provides better error diagnosing and more user friendly debug ... No such file or directory // Write to file (disk file, ...

JSON for Modern C++ | BestOfCpp

Jan 4, 2022 — json.hpp is the single required file in single_include/nlohmann or ... Furthermore, no exceptions are thrown in case of a parse error - it ...

Check in the 4.0.0 release - Marc.Info

+ var breaker = {}; + + // Save bytes in the minified (but not gzipped) ... index, list) { + results[results.length] = iterator.call(context, value, index, ...

tutorial request problem - C++ Forum

Oct 13, 2020 — line 3 fatal error: string_view: no such file or directory. Last edited on Oct 13, ... gcc is the C compiler, not the C++ compiler.Missing: sale ‎| Must include: sale

fatal error no such file or directory code blocks - YouTube

not identified as such, is not to be taken as an expression of opinion as to whether or ... Throw an exception if an unrecoverable input error occurs, e.g.,.

Atmel studio sam h no such file or directory Jobs, Employment ...

Search for jobs related to Atmel studio sam h no such file or directory or hire on the world's largest freelancing marketplace with 20m+ jobs.

In mixed C/C++ application CubeIDE does not find cstdint ...

Nov 29, 2019 — App/Inc/cluster_data.hpp:7:10: fatal error: cstdint: No such file or directory; #include <cstdint>; ^~~~~~~~~; compilation terminated.

A Comprehensive Guide for Developers — Steve Scargall - OAPEN

Category: Software

Listings 12 - 38 — as such, is not to be taken as an expression of opinion as to whether or not ... Ken Gibson is the director of persistent memory software ...

pgirn181-openpower.pdf - PGI Compilers & Tools

std::string_view ... construct; this placement may result in an error at runtime. ... installation directory if no such file already exists.

Reference Manual :: PGI version 19.1 Documentation for x86 ...

Jan 24, 2019 — Messages provides a list of compiler error messages. ... [no]iomutex, Determines whether critical sections are generated around Fortran I/O ...

Download Patch File

+%%LEGACY_LIMITS%%# mysql_(instance_)?limits (bool): Set to "NO" by default. ... No such file or directory BROKEN_armv7= fails to package: cp: bazel: No ...

How to include C++ 17 headers with g++ 6.2.0 with - py4u

<filename>.cpp:5:20 fatal error: optional: No such file or directory ... I also can't include <any> , <string_view> or <variant> , getting the same error.Missing: sale ‎| Must include: sale

swift/CppInteroperabilityManifesto.md at main · apple/swift · GitHub ...

since inout parameters are not pointers, there is no such thing as “null ... in Swift. struct File { public init(_ filename: std.string_view) public func ...

Top Categories

Top Stores